زمین‌شناسی چهرنگاشتی
type: Concept
preferred label: physiographic geology @en
related: زمین‌شناسی
scope note: شاخه‌ای از زمین‌شناسی که به عارضه‌نگاری می‌پردازد

زمین‌شناسی
type: Concept
preferred label: geology @en
related: زمین‌شناسی چهرنگاشتی