زمین‏شناسی آب زیرزمینی
type: Concept
preferred label: ground water geology @en
related: زمین‌شناسی
related: آب زیرزمینی
scope note: دانشی که به بحث در مورد آب‌های زیرسطحی و جنبه‏های زمین‏شناختی آنها می‌پردازد

زمین‌شناسی
type: Concept
preferred label: geology @en
related: زمین‏شناسی آب زیرزمینی

آب زیرزمینی
type: Concept
preferred label: ground water @en
related: زمین‏شناسی آب زیرزمینی