علم زمین‌ساخت
type: Concept
preferred label: tectonics @en
related: زمین‌ساخت رسوبی

زمین‌ساخت رسوبی
type: Concept
preferred label: sedimentary tectonics @en
related: حوضه رسوبی
related: علم زمین‌ساخت
scope note: مطالعۀ علمی جنبه‌های زمین‌ساختی لایه‌های رسوبی یا حوضه‌های رسوبی

حوضه رسوبی
type: Concept
preferred label: sedimentary basin @en
related: زمین‌ساخت رسوبی