ریوجیما
type: Concept
preferred label: Ryujima @en
related: ناگانو ژاپن
related: هونشو
scope note: جزیره‌ای در دریای ژاپن کناره شبه جزیره نوتو.

ناگانو ژاپن
type: Concept
preferred label: Nagano Japan @en
related: ریوجیما

هونشو
type: Concept
preferred label: Honshu @en
related: ریوجیما