رودخانه سالمون
type: Concept
preferred label: Salmon River @en
related: ایداهو
scope note: از مرکز ایداهو منشاء گرفته و در جهت شمال و سپس غرب و دوباره شمال برای تخلیه در رود اسنک در غرب ایداهو جریان می یابد. ممکن است در محلهای دیگر نیز یافت شود

ایداهو
type: Concept
preferred label: Idaho @en
related: رودخانه سالمون