رودخانه دون
type: Concept
preferred label: Don River @en
related: فدراسیون روسیه
related: حوضه دون
scope note: از جنوب شرق تولا سرچشمه گرفته و در جهت جنوب شرقی به سوی یک پیچ بزرگ نزدیک رود ولگا جریان می یابد و سپس در جهت جنوب غربی به سوی دریای آزوو در روستوف جریان می یابد. ضمناً شاید در مکانهای دیگر واقع شده باشد.

حوضه دون
type: Concept
preferred label: Don Basin @en
related: رودخانه دون

فدراسیون روسیه
type: Concept
preferred label: Russian Federation @en
related: رودخانه دون