رود دگرجازاد
type: Concept
broader: رود
preferred label: allogenic stream @en
scope note: رودی که بیشتر آب آن از سرزمینی دوردست تأمین می‌شود

رود
type: Concept
narrower: رود دگرجازاد
preferred label: stream @en