رود شیبی
type: Concept
broader: رود
preferred label: dip stream @en
scope note: رودی که در راستای شیب لایه‏های بستر خود جریان داشته باشد

رود
type: Concept
narrower: رود شیبی
preferred label: stream @en