ساختار بلور
type: Concept
preferred label: crystal structure @en
related: روبنا

روبنا
type: Concept
preferred label: superstructure @en
related: ساختار بلور
scope note: قشر زمین‌ساختی رویی در یک نوار کوهزایی که تحت تأثیر دگرشکلی‌های عمق کم قرار گرفته باشد.