رشته‌کوه باکسکین
type: Concept
preferred label: Buckskin Mountains @en
related: ناحیه یوما آریزونا
related: ناحیه لاپاز آریزونا
scope note: غرب مرکز آریزونا. ممکن است همچنین در جاهای دیگر نیز واقع شده باشد.

ناحیه لاپاز آریزونا
type: Concept
preferred label: La Paz County Arizona @en
related: رشته‌کوه باکسکین

ناحیه یوما آریزونا
type: Concept
preferred label: Yuma County Arizona @en
related: رشته‌کوه باکسکین