رشته‌کوه استون
type: Concept
preferred label: Stone Mountain @en
related: ناحیه دکلب جورجیا
scope note: تپه سنگ گرانیتی خاکستری هیوگ در ناحیه دکالب نزدیک آتلانتا، ضمناً در محلهای دیگر نیز واقع شده است.

ناحیه دکلب جورجیا
type: Concept
preferred label: De Kalb County Georgia @en
related: رشته‌کوه استون