رسوب‌نگار
type: Concept
preferred label: sedimentograph @en
related: رسوب
scope note: دستگاهی که به‌طور مستقیم منحنی اندازۀ انباشتی رسوب را نشان می‌دهد

رسوب
type: Concept
preferred label: sediment @en
related: رسوب‌نگار