رسوب‌گذاری چرخه‌ای
type: Concept
broader: رسوب‌گذاری
preferred label: cyclic sedimentation @en
scope note: نهشته‌ شدن انواع مختلف رسوبات در یک توالی منظم تکراری

رسوب‌گذاری
type: Concept
narrower: رسوب‌گذاری چرخه‌ای
preferred label: sedimentation @en