رسوب‌گذاری شیمیایی
type: Concept
broader: رسوب‌گذاری
preferred label: chemical sedimentation @en
scope note: رسوب‌گذاری که توسط خاصیت یونی عناصر معلق در آب صورت می گیرد.

رسوب‌گذاری
type: Concept
narrower: رسوب‌گذاری شیمیایی
preferred label: sedimentation @en