ماسه آتشفشانی
type: Concept
broader: ماسه
preferred label: volcanic sand @en
scope note: نهشته‏ای سخت‌نشده از ذراتی آتشفشانی به اندازۀ ماسه

ماسه
type: Concept
narrower: ماسه آتشفشانی
preferred label: sand @en