ماسه ریگ‏دار
type: Concept
broader: ماسه
preferred label: pebbly sand @en
scope note: رسوبی سخت‏نشده حاوی حداقل 75 درصد ماسه و حداکثر 25 درصد ریگ

ماسه
type: Concept
narrower: ماسه ریگ‏دار
preferred label: sand @en