گوانو
type: Concept
broader: رسوب
preferred label: Guano @en
scope note: مدفوع و فضولات پرندگان دریایی که بر روی هم انباشته و متراکم گردیده‌اند و سپس به طور طبیعی دگرگون و تغییر یافته است. در بعضی از جزایر اقیانوس آرام، پرو، شیلی این فضولات پراکنده است. از آن به عنوان کود استفاده می‌شود.

رسوب
type: Concept
narrower: گوانو
preferred label: sediment @en