واحد سنگ‌چینه‌نگاشتی
type: Concept
preferred label: lithostratigraphic unit @en
related: رده‌بندی سنگ‌چینه‌نگاشتی

رده‌بندی سنگ‌چینه‌نگاشتی
type: Concept
preferred label: lithostratigraphic classification @en
related: واحد سنگ‌چینه‌نگاشتی
scope note: سازماندهی چینه‌های سنگ بر مبنای ویژگی‌های سنگ‌شناختی آنها