رده دودوازده‌وجهی
type: Concept
broader: رده بلوری
preferred label: diploidal class @en
scope note: رده بلوری در سامانه مکعبی با تقارن -3 2/0m

رده بلوری
type: Concept
narrower: رده دودوازده‌وجهی
preferred label: crystal class @en