رده سه‌گوش‌ ـ هرمی
type: Concept
broader: رده بلوری
preferred label: trigonal-pyramidal class @en
scope note: رده‌ای در بخش لوزوجهی سامانه شش‌گوش با تقارن 3

رده بلوری
type: Concept
narrower: رده سه‌گوش‌ ـ هرمی
preferred label: crystal class @en