رده شش‌گوش‌ ـ دوهرمی
type: Concept
broader: رده بلوری
preferred label: hexagonal-dipyramidal class @en
scope note: رده بلوری در سامانه شش‌گوش با تقارن 6/0m

رده بلوری
type: Concept
narrower: رده شش‌گوش‌ ـ دوهرمی
preferred label: crystal class @en