رده منشوری
type: Concept
broader: رده بلوری
preferred label: prismatic class @en
scope note: رده‌ای بلوری در سامانه تک‌شیبی که دارای تقارن 2/0m است

رده بلوری
type: Concept
narrower: رده منشوری
preferred label: crystal class @en