رخساره سنگ‌نگاشتی
type: Concept
preferred label: petrographic facies @en
related: رخساره
scope note: رخساره‌ای که ازطریق ترکیب و ظاهر سنگ قابل تشخیص است

رخساره
type: Concept
preferred label: facies @en
related: رخساره سنگ‌نگاشتی