رخ انحلالی
type: Concept
broader: رخ
preferred label: solution cleavage @en
scope note: رخی که با رگه‌های بازماندۀ انحلال‌ناپذیر یا سوگیری ترجیحی دانه‌های طویل یا ورقه‌های میکا مشخص می‌شود

رخ
type: Concept
narrower: رخ انحلالی
preferred label: cleavage @en