رخ کنگره‌ای
type: Concept
broader: رخ
preferred label: crenulation cleavage @en
scope note: رخی ناشی از سوگیری ترجیحی لایه‌های سنگ یا دانه‌های کانی که براثر چین‌خوردگی ریزمقیاس به ‌وجود می‌آید

رخ
type: Concept
narrower: رخ کنگره‌ای
preferred label: cleavage @en