ذوزنقه‌وجهی سه‌گوش
type: Concept
alternative label: ذوزنقه‌وجهی سه‌گوشه‌ای
broader: ذوزنقه‌وجهی
preferred label: trigonal trapezohedron @en
scope note: دیسۀ بلوری شش‌وجه با یک محور سه‌تایه و سه محور دوتایه که فاقد صفحۀ آینه‌ای و مرکز تقارن است

ذوزنقه‌وجهی
type: Concept
narrower: ذوزنقه‌وجهی سه‌گوش
preferred label: trapezohedron @en