ذوب ضربه‌ای
type: Concept
preferred label: shock melting @en
related: ذوب جزء‌به‌جزء
related: ذوب بخشی
scope note: ذوب مواد در دمای بالای حاصل از امواج ضربه‌ای پرفشار

ذوب جزء‌به‌جزء
type: Concept
preferred label: fractional melting @en
related: ذوب ضربه‌ای

ذوب بخشی
type: Concept
preferred label: partial melting @en
related: ذوب ضربه‌ای