زمین‌شیمی
type: Concept
preferred label: geochemistry @en
related: دی‌متیل سولفید

دی‌متیل سولفید
type: Concept
alternative label: متیل سولفید
preferred label: dimethyl sulfide @en
related: زمین‌شیمی
scope note: گاز متصاعد شده از فاضلاب بسیار آلوده. مایعی بیرنگ با دمای جوش 37 درجه سانتیگراد که از گرم کردن متانول با تیونیل کلرید ساخته می شود.