دوقلوی دگرشکلی
type: Concept
broader: دوقلوزایی
preferred label: deformation twin @en
scope note: بلوری دوقلویی که در نتیجۀ دگرشکلی در بلور قبلی به وجود می‌آید

دوقلوزایی
type: Concept
narrower: دوقلوی دگرشکلی
preferred label: twinning @en