دوشکستی مثبت
type: Concept
broader: دوشکستی
preferred label: positive birefringence @en
scope note: نوعی دوشکستی که در آن سرعت باریکۀ عادی بیش از نور باریکۀ غیرعادی است

دوشکستی
type: Concept
narrower: دوشکستی مثبت
preferred label: birefringence @en