پشته مدیترانه‌ای
type: Concept
broader: دریای مدیترانه
preferred label: Mediterranean Ridge @en
scope note: در جنوب کرت و شمال سواحل شرق لیبی و غرب مصر امتداد دارد.

دریای مدیترانه
type: Concept
narrower: پشته مدیترانه‌ای
preferred label: Mediterranean Sea @en