محیط دریامیانی
type: Concept
preferred label: pelagic environment @en
related: دریامیانی

رسوب‌گذاری دریامیانی
type: Concept
preferred label: pelagic sedimentation @en
related: دریامیانی

دریامیانی
type: Concept
preferred label: pelagic @en
related: محیط دریامیانی
related: رسوب‌گذاری دریامیانی
scope note: مربوط به اندامگان‌های دریایی که محیط زیست آنها دریای آزاد باشد، نه بستر یا مناطق ساحلی دریا. آنچه به محیط آب اقیانوس‌ها مربوط شود