دریاچه فرسایشی
type: Concept
broader: دریاچه
preferred label: erosion lake @en
scope note: دریاچۀ پرکنندۀ حوضه‏ای که براثر فرسایش به وجود آمده است

دریاچه
type: Concept
narrower: دریاچه فرسایشی
preferred label: lake @en