دره میدلند
type: Concept
preferred label: Midland Valley @en
related: اسکاتلند
related: ایرلند
scope note: جنوب اسکاتلند. ضمناً در نیوبرونشویک و جاهای دیگر نیز واقع شده است.

ایرلند
type: Concept
preferred label: Ireland @en
related: دره میدلند

اسکاتلند
type: Concept
preferred label: Scotland @en
related: دره میدلند