درجا
type: Concept
preferred label: in situ @en
related: برگرداندن
scope note: مورد استفاده برای بسیاری از حوضه‌ها خصوصاً سنگ‌ها، خاک‌ها، یا فسیل‌ها هنگامی که در جای خود به صورت اولیه تشکیل شده یا رسوب می‌نمایند.

برگرداندن
type: Concept
preferred label: retorting @en
related: درجا