خوشه آتشفشانی
type: Concept
preferred label: volcanic cluster @en
related: آتشفشان
related: آتشفشانی
scope note: گروهی از دهانه‏های آتشفشانی که آرایشی به‌ظاهر تصادفی دارند

آتشفشانی
type: Concept
preferred label: volcanic @en
related: خوشه آتشفشانی

آتشفشان
type: Concept
preferred label: volcano @en
related: خوشه آتشفشانی