خلیج سبز
type: Concept
preferred label: Green Bay @en
related: میشیگان
related: ویسکونزین
scope note: خلیج کوچکی در شمال غرب دریاچه میشیگان در شمال شرق ویسکونزین و شمال غرب میشیگان. ممکن است در جاهای دیگری نیز واقع باشد.

میشیگان
type: Concept
preferred label: Michigan @en
related: خلیج سبز

ویسکونزین
type: Concept
preferred label: Wisconsin @en
related: خلیج سبز