خلیج آیسی (یخی)
type: Concept
preferred label: Icy Bay @en
related: آلاسکای جنوبی
related: خلیج آلاسکا
scope note: آبراهه فرعی خلیج آلاسکا، جنوب شرق آلاسکا، غرب خلیج یاکوتا.

آلاسکای جنوبی
type: Concept
preferred label: Southern Alaska @en
related: خلیج آیسی (یخی)

خلیج آلاسکا
type: Concept
preferred label: Gulf of Alaska @en
related: خلیج آیسی (یخی)