خطوارگی پله‌ای-جدایی
type: Concept
broader: خط‌وارگی
preferred label: parting-step lineation @en
scope note: نوعی خطوارگی جدایی که ویژگی آن وجود تیغه‌های پله‌مانند تقریباً موازی است.

خط‌وارگی
type: Concept
narrower: خطوارگی پله‌ای-جدایی
preferred label: lineation @en