درزدار
type: Concept
preferred label: sutured @en
related: خط درز

درز
type: Concept
preferred label: suture @en
related: خط درز

خط درز
type: Concept
preferred label: suture line @en
related: درزدار
related: درز
scope note: خط روی صدف خارپوستان یا شکم‏پایان و جانوران صدف‏دار دیگر