خزش ثانویه
type: Concept
broader: خزش
preferred label: secondary creep @en
scope note: حرکت یک سیال روان با شیب ثابت که پس از خزش اولیه صورت می‌گیرد

خزش
type: Concept
narrower: خزش ثانویه
preferred label: creep @en