خزش سطحی
type: Concept
broader: خزش
preferred label: surface creep @en
scope note: حرکت آهستۀ دانه‏های درشت در طول یک سطح براثر جهش دانه‏های کوچک‌تر

خزش
type: Concept
narrower: خزش سطحی
preferred label: creep @en