سنگ‏خزش
type: Concept
broader: خزش
preferred label: rock creep @en
scope note: نوعی جریان آرام مواد سنگی به طرف دامنه که از رخنمون سنگ اصلی فاصله گرفته است

خزش
type: Concept
narrower: سنگ‏خزش
preferred label: creep @en