گسل
type: Concept
preferred label: fault @en
related: خاکه گسلی

خاکه گسلی
type: Concept
preferred label: fault gouge @en
related: گسل
scope note: مواد رسی نرم و سیمانی‌نشده که در امتداد برخی گسل‌ها یا در بین دیواره‌های یک گسل یافت می‌شود