گدازه
type: Concept
preferred label: lava @en
related: خاکریز گدازه

خاکریز گدازه
type: Concept
preferred label: lava levee @en
related: گدازه
scope note: ورقه‌های سنگ‌پایی از گدازه که بر روی مسیرهای طبیعی خود جریان یافته و خاکریزی جامد به وجود می‌آورد