گروه خاک
type: Concept
preferred label: soil group @en
related: خاک قرمز

خاک قرمز
type: Concept
broader: خاک
preferred label: Terra rossa @en
related: گروه خاک
scope note: خاکی که بر روی سنگهای آهکی و غیر آهکی وجود دارد، رس در اینگونه خاکها با ذرات کوارتز درشت درهم آمیخته است و درز و شکاف‌های آهک را پر کرده است.

خاک
type: Concept
narrower: خاک قرمز
preferred label: soil @en