خاک‏آهک
type: Concept
broader: خاک
preferred label: pedocal @en
scope note: گروه بزرگی از خاک‌ها که در فرایند تشکیل آنها عنصر کلسیم انباشته شود

خاک
type: Concept
narrower: خاک‏آهک
preferred label: soil @en