خاک‏آهن
type: Concept
broader: خاک
preferred label: pedalfer @en
scope note: گروه بزرگی از خاک‌ها که در فرایند تشکیل آنها مقدار اکسید فلزات سه‌ظرفیتی بیش از سیلیس باشد

خاک
type: Concept
narrower: خاک‏آهن
preferred label: soil @en