گیاخاک
type: Concept
broader: خاک
preferred label: Mor @en
related: مول
scope note: نوعی خاک هوموس که در خاک جنگلهای سوزنی برگ یافت می شود و دارای خاک اسیدی و تا حدودی مواد مغذی است.

مول
type: Concept
preferred label: Mull @en
related: گیاخاک

خاک
type: Concept
narrower: گیاخاک
preferred label: soil @en