حوضه هارتفورد
type: Concept
preferred label: Hartford Basin @en
related: ماساچوست
related: کانکتیکوت
scope note: حوضه ریفتی تریاس تا ژوراسیک در مرکز کانکتیکوت و غرب ماساچوست.

کانکتیکوت
type: Concept
preferred label: Connecticut @en
related: حوضه هارتفورد

ماساچوست
type: Concept
preferred label: Massachusetts @en
related: حوضه هارتفورد